Reaction Details
TargetBcl-2-like protein 11
LigandBDBM54849
Substrate/Competitorn/a
Meas. Tech.Luminescence Cell-Based Dose Retest to Identify Inhibitors of A1 Apoptosis
EC50 4172±n/a nM
Citation PubChem, PC Luminescence Cell-Based Dose Retest to Identify Inhibitors of A1 Apoptosis PubChem Bioassay(2010)[AID]
 
Bcl-2-like protein 11
Name:Bcl-2-like protein 11
Type:PROTEIN
Mol. Mass.:22175.26
Organism:Homo sapiens (Human)
Description:EBI_101325
Residue:198
BDBM54849
NameBDBM54849
Synonyms:5-chloranyl-N-[4-(2-ethylpiperidin-1-yl)sulfonylphenyl]-2-methylsulfonyl-pyrimidine-4-carboxamide 5-chloro-N-[4-(2-ethylpiperidino)sulfonylphenyl]-2-mesyl-pyrimidine-4-carboxamide BRD-A72341983-001-05-8 | cid_16437205
TypeSmall organic molecule
Emp. Form.C19H23ClN4O5S2
Mol. Mass.486.993
SMILESCCC1CCCCN1S(=O)(=O)c1ccc(NC(=O)c2nc(ncc2Cl)S(C)(=O)=O)cc1