Reaction Details
TargetApelin receptor
LigandBDBM38993
Substrate/Competitorn/a
Meas. Tech.Dose Response confirmation of uHTS hits from a small molecule antagonists of the APJ receptor via a luminescent beta-arrestin assay
IC50 9670±n/a nM
Citation PubChem, PC Dose Response confirmation of uHTS hits from a small molecule antagonists of the APJ receptor via a luminescent beta-arrestin assay PubChem Bioassay(2010)[AID]
 
Apelin receptor
Name:Apelin receptor
Type:Enzyme Catalytic Domain
Mol. Mass.:42664.06
Organism:Homo sapiens (Human)
Description:P35414
Residue:380
BDBM38993
NameBDBM38993
Synonyms:(1Z,3Z)-1,4-bis(butylsulfonyl)buta-1,3-diene SMR000020833 | cid_5286934
TypeSmall organic molecule
Emp. Form.C12H22O4S2
Mol. Mass.294.431
SMILESCCCCS(=O)(=O)\C=C/C=C\S(=O)(=O)CCCC