Reaction Details
TargetApelin receptor
LigandBDBM43484
Substrate/Competitorn/a
Meas. Tech.Dose Response confirmation of uHTS hits from a small molecule antagonists of the APJ receptor via a luminescent beta-arrestin assay
IC50 21300±n/a nM
Citation PubChem, PC Dose Response confirmation of uHTS hits from a small molecule antagonists of the APJ receptor via a luminescent beta-arrestin assay PubChem Bioassay(2010)[AID]
 
Apelin receptor
Name:Apelin receptor
Type:Enzyme Catalytic Domain
Mol. Mass.:42664.06
Organism:Homo sapiens (Human)
Description:P35414
Residue:380
BDBM43484
NameBDBM43484
Synonyms:(3aR,5R,5aR,8aR,9S,9aS)-5,8a-dimethyl-1-methylidene-9-oxidanyl-3a,4,5,5a,9,9a-hexahydroazuleno[6,7-b]furan-2,8-dione (3aR,5R,5aR,8aR,9S,9aS)-9-hydroxy-5,8a-dimethyl-1-methylene-3a,4,5,5a,9,9a-hexahydroazuleno[6,7-b]furan-2,8-quinone Helenalin SMR000445626 | cid_23205
TypeSmall organic molecule
Emp. Form.C15H18O4
Mol. Mass.262.301
SMILESC[C@@H]1C[C@H]2OC(=O)C(=C)[C@H]2[C@H](O)[C@@]2(C)[C@H]1C=CC2=O