Reaction Details
TargetSerine/threonine-protein kinase 33
LigandBDBM39195
Substrate/Competitorn/a
Meas. Tech.Luminescence Cell-Free Homogenous Dose Retest to Identify Inhibitors of Serine/Threonine Kinase 33 Activity
EC50 11840±n/a nM
Citation PubChem, PC Luminescence Cell-Free Homogenous Dose Retest to Identify Inhibitors of Serine/Threonine Kinase 33 Activity PubChem Bioassay(2010)[AID]
 
Serine/threonine-protein kinase 33
Name:Serine/threonine-protein kinase 33
Type:Enzyme Catalytic Domain
Mol. Mass.:57833.21
Organism:Homo sapiens (Human)
Description:gi_23943882
Residue:514
BDBM39195
NameBDBM39195
Synonyms:(9Z)-9-hydroximinofluorene-4-carboxylic acid methyl ester 9-hydroximinofluorene-4-carboxylic acid methyl ester MLS000070237 cid_6398908 | methyl 9-hydroxyiminofluorene-4-carboxylate
TypeSmall organic molecule
Emp. Form.C15H11NO3
Mol. Mass.253.2527
SMILESCOC(=O)c1cccc2C(N=O)c3ccccc3-c12