Reaction Details
TargetSerine/threonine-protein kinase 33
LigandBDBM67567
Substrate/Competitorn/a
Meas. Tech.Luminescence Cell-Free Homogenous Dose Retest to Identify Inhibitors of Serine/Threonine Kinase 33 Activity
EC50 7928±n/a nM
Citation PubChem, PC Luminescence Cell-Free Homogenous Dose Retest to Identify Inhibitors of Serine/Threonine Kinase 33 Activity PubChem Bioassay(2010)[AID]
 
Serine/threonine-protein kinase 33
Name:Serine/threonine-protein kinase 33
Type:Enzyme Catalytic Domain
Mol. Mass.:57833.21
Organism:Homo sapiens (Human)
Description:gi_23943882
Residue:514
BDBM67567
NameBDBM67567
Synonyms:1-(2-Methoxy-phenyl)-3-(3-methyl-pyridin-2-yl)-urea 1-(2-methoxyphenyl)-3-(3-methyl-2-pyridyl)urea MLS000072334 cid_651733
TypeSmall organic molecule
Emp. Form.C14H15N3O2
Mol. Mass.257.2878
SMILESCOc1ccccc1NC(=O)Nc1ncccc1C