Reaction Details
TargetGuanine nucleotide-binding protein G(o) subunit alpha
LigandBDBM67699
Substrate/Competitorn/a
Meas. Tech.Dose response, multiplexed high-throughput screen for small molecule regulators of RGS family protein interactions, specifically RGS8-Galphao with additional round of SAR compounds
EC50>30000±0 nM
Citation PubChem, PC Dose response, multiplexed high-throughput screen for small molecule regulators of RGS family protein interactions, specifically RGS8-Galphao with additional round of SAR compounds PubChem Bioassay(2010)[AID]
 
Guanine nucleotide-binding protein G(o) subunit alpha
Name:Guanine nucleotide-binding protein G(o) subunit alpha
Type:PROTEIN
Mol. Mass.:40043.59
Organism:Homo sapiens (Human)
Description:ChEMBL_321106
Residue:354
BDBM67699
NameBDBM67699
Synonyms:(3-chloranyl-6-nitro-1-benzothiophen-2-yl)-piperazin-1-yl-methanone (3-chloro-6-nitro-1-benzothiophen-2-yl)-piperazin-1-ylmethanone KSC-1-99c cid_4496360
TypeSmall organic molecule
Emp. Form.C13H12ClN3O3S
Mol. Mass.325.771
SMILES[O-][N+](=O)c1ccc2c(Cl)c(sc2c1)C(=O)N1CCNCC1