Reaction Details
TargetGuanine nucleotide-binding protein G(o) subunit alpha
LigandBDBM67700
Substrate/Competitorn/a
Meas. Tech.Dose response, multiplexed high-throughput screen for small molecule regulators of RGS family protein interactions, specifically RGS16-Galphao with additional round of SAR compounds
EC50>30000±0 nM
Citation PubChem, PC Dose response, multiplexed high-throughput screen for small molecule regulators of RGS family protein interactions, specifically RGS16-Galphao with additional round of SAR compounds PubChem Bioassay(2010)[AID]
 
Guanine nucleotide-binding protein G(o) subunit alpha
Name:Guanine nucleotide-binding protein G(o) subunit alpha
Type:PROTEIN
Mol. Mass.:40043.59
Organism:Homo sapiens (Human)
Description:ChEMBL_321106
Residue:354
BDBM67700
NameBDBM67700
Synonyms:3-chloranyl-6-nitro-1-benzothiophene-2-carboxamide 3-chloro-6-nitro-benzothiophene-2-carboxamide KUC103873N | cid_874677
TypeSmall organic molecule
Emp. Form.C9H5ClN2O3S
Mol. Mass.256.666
SMILESNC(=O)c1sc2cc(ccc2c1Cl)[N+]([O-])=O