Reaction Details
TargetDNA damage-inducible transcript 3 protein
LigandBDBM67717
Substrate/Competitorn/a
Meas. Tech.Dose-response primary assay and counterscreen assay for HTS small molecule inhibitors of CHOP to regulate the unfolded protein response to ER stress
IC50<160±n/a nM
Citation PubChem, PC Dose-response primary assay and counterscreen assay for HTS small molecule inhibitors of CHOP to regulate the unfolded protein response to ER stress PubChem Bioassay(2010)[AID]
 
DNA damage-inducible transcript 3 protein
Name:DNA damage-inducible transcript 3 protein
Type:Enzyme Catalytic Domain
Mol. Mass.:19175.17
Organism:Mus musculus
Description:gi_160707929
Residue:168
BDBM67717
NameBDBM67717
Synonyms:8-[(4-chlorobenzyl)thio]-7-isoamyl-3-methyl-xanthine 8-[(4-chlorophenyl)methylthio]-3-methyl-7-(3-methylbutyl)purine-2,6-dione SMR000057707 | cid_658140
TypeSmall organic molecule
Emp. Form.C18H21ClN4O2S
Mol. Mass.392.903
SMILESCC(C)CCn1c(SCc2ccc(Cl)cc2)nc2n(C)c(=O)[nH]c(=O)c12