Reaction Details
TargetDNA damage-inducible transcript 3 protein
LigandBDBM36923
Substrate/Competitorn/a
Meas. Tech.Dose-response primary assay and counterscreen assay for HTS small molecule inhibitors of CHOP to regulate the unfolded protein response to ER stress
IC50>10000±n/a nM
Citation PubChem, PC Dose-response primary assay and counterscreen assay for HTS small molecule inhibitors of CHOP to regulate the unfolded protein response to ER stress PubChem Bioassay(2010)[AID]
 
DNA damage-inducible transcript 3 protein
Name:DNA damage-inducible transcript 3 protein
Type:Enzyme Catalytic Domain
Mol. Mass.:19175.17
Organism:Mus musculus
Description:gi_160707929
Residue:168
BDBM36923
NameBDBM36923
Synonyms:(Z)-3,4-bis(benzenesulfonyl)-2-buten-1-ol (Z)-3,4-bis(phenylsulfonyl)but-2-en-1-ol MLS000080860 cid_5389617
TypeSmall organic molecule
Emp. Form.C16H16O5S2
Mol. Mass.352.425
SMILESOC\C=C(\CS(=O)(=O)c1ccccc1)S(=O)(=O)c1ccccc1