Reaction Details
TargetDNA damage-inducible transcript 3 protein
LigandBDBM41599
Substrate/Competitorn/a
Meas. Tech.Dose-response primary assay and counterscreen assay for HTS small molecule inhibitors of CHOP to regulate the unfolded protein response to ER stress
IC50<160±n/a nM
Citation PubChem, PC Dose-response primary assay and counterscreen assay for HTS small molecule inhibitors of CHOP to regulate the unfolded protein response to ER stress PubChem Bioassay(2010)[AID]
 
DNA damage-inducible transcript 3 protein
Name:DNA damage-inducible transcript 3 protein
Type:Enzyme Catalytic Domain
Mol. Mass.:19175.17
Organism:Mus musculus
Description:gi_160707929
Residue:168
BDBM41599
NameBDBM41599
Synonyms:(E)-[1-[4-(4-chlorobenzyl)oxyphenyl]-2,5-dimethyl-pyrrol-3-yl]methylene-(1,2,4-triazol-4-yl)amine 1-[1-[4-[(4-chlorophenyl)methoxy]phenyl]-2,5-dimethyl-pyrrol-3-yl]-N-(1,2,4-triazol-4-yl)methanimine MLS000534371 SMR000141803 cid_1282232
TypeSmall organic molecule
Emp. Form.C22H20ClN5O
Mol. Mass.405.88
SMILESCc1cc(C=Nn2cnnc2)c(C)n1-c1ccc(OCc2ccc(Cl)cc2)cc1