Reaction Details
TargetDNA damage-inducible transcript 3 protein
LigandBDBM62439
Substrate/Competitorn/a
Meas. Tech.Dose-response primary assay and counterscreen assay for HTS small molecule inhibitors of CHOP to regulate the unfolded protein response to ER stress
IC50 170±n/a nM
Citation PubChem, PC Dose-response primary assay and counterscreen assay for HTS small molecule inhibitors of CHOP to regulate the unfolded protein response to ER stress PubChem Bioassay(2010)[AID]
 
DNA damage-inducible transcript 3 protein
Name:DNA damage-inducible transcript 3 protein
Type:Enzyme Catalytic Domain
Mol. Mass.:19175.17
Organism:Mus musculus
Description:gi_160707929
Residue:168
BDBM62439
NameBDBM62439
Synonyms:MLS000570595 N-[[(E)-3-(1,3-benzodioxol-5-yl)prop-2-enylidene]amino]-2-(2,3-dimethylphenoxy)acetamide SMR000187020 | cid_2263315
TypeSmall organic molecule
Emp. Form.C20H20N2O4
Mol. Mass.352.3838
SMILESCc1cccc(OCC(=O)NN=C\C=C\c2ccc3OCOc3c2)c1C