Reaction Details
TargetDNA damage-inducible transcript 3 protein
LigandBDBM52406
Substrate/Competitorn/a
Meas. Tech.Dose-response primary assay and counterscreen assay for HTS small molecule inhibitors of CHOP to regulate the unfolded protein response to ER stress
IC50 170±n/a nM
Citation PubChem, PC Dose-response primary assay and counterscreen assay for HTS small molecule inhibitors of CHOP to regulate the unfolded protein response to ER stress PubChem Bioassay(2010)[AID]
 
DNA damage-inducible transcript 3 protein
Name:DNA damage-inducible transcript 3 protein
Type:Enzyme Catalytic Domain
Mol. Mass.:19175.17
Organism:Mus musculus
Description:gi_160707929
Residue:168
BDBM52406
NameBDBM52406
Synonyms:4-[(5Z)-5-(4-ethylbenzylidene)-4-keto-2-thioxo-thiazolidin-3-yl]-N-(2-pyridyl)butyramide 4-[(5Z)-5-[(4-ethylphenyl)methylidene]-4-oxo-2-sulfanylidene-1,3-thiazolidin-3-yl]-N-pyridin-2-ylbutanamide 4-[5-(4-ethylbenzylidene)-4-oxo-2-thioxo-1,3-thiazolidin-3-yl]-N-2-pyridinylbutanamide SMR000194806 | cid_1335223
TypeSmall organic molecule
Emp. Form.C21H21N3O2S2
Mol. Mass.411.54
SMILESCCc1ccc(\C=C2/SC(=S)N(CCCC(=O)Nc3ccccn3)C2=O)cc1