Reaction Details
TargetDNA damage-inducible transcript 3 protein
LigandBDBM50213
Substrate/Competitorn/a
Meas. Tech.Dose-response primary assay and counterscreen assay for HTS small molecule inhibitors of CHOP to regulate the unfolded protein response to ER stress
IC50 170±n/a nM
Citation PubChem, PC Dose-response primary assay and counterscreen assay for HTS small molecule inhibitors of CHOP to regulate the unfolded protein response to ER stress PubChem Bioassay(2010)[AID]
 
DNA damage-inducible transcript 3 protein
Name:DNA damage-inducible transcript 3 protein
Type:Enzyme Catalytic Domain
Mol. Mass.:19175.17
Organism:Mus musculus
Description:gi_160707929
Residue:168
BDBM50213
NameBDBM50213
Synonyms:3-Hydroxy-naphthalene-2-carboxylic acid (1-benzyl-2-oxo-1,2-dihydro-indol-3-ylidene)-hydrazide 3-oxidanyl-N-[(Z)-[2-oxidanylidene-1-(phenylmethyl)indol-3-ylidene]amino]naphthalene-2-carboxamide N-[(Z)-(1-benzyl-2-keto-indolin-3-ylidene)amino]-3-hydroxy-2-naphthamide SMR000171355 | cid_9591396
TypeSmall organic molecule
Emp. Form.C26H19N3O3
Mol. Mass.421.4474
SMILESOc1cc2ccccc2cc1C(=O)N\N=C1/C(=O)N(Cc2ccccc2)c2ccccc12