Reaction Details
TargetDNA damage-inducible transcript 3 protein
LigandBDBM68062
Substrate/Competitorn/a
Meas. Tech.Dose-response primary assay and counterscreen assay for HTS small molecule inhibitors of CHOP to regulate the unfolded protein response to ER stress
IC50<160±n/a nM
Citation PubChem, PC Dose-response primary assay and counterscreen assay for HTS small molecule inhibitors of CHOP to regulate the unfolded protein response to ER stress PubChem Bioassay(2010)[AID]
 
DNA damage-inducible transcript 3 protein
Name:DNA damage-inducible transcript 3 protein
Type:Enzyme Catalytic Domain
Mol. Mass.:19175.17
Organism:Mus musculus
Description:gi_160707929
Residue:168
BDBM68062
NameBDBM68062
Synonyms:MLS000335164 N-cyclopropyl-5-[1-(2-fluorophenyl)-2,5-dimethyl-pyrrol-3-yl]-6H-1,3,4-thiadiazin-2-amine SMR000249922 cyclopropyl-[5-[1-(2-fluorophenyl)-2,5-dimethyl-pyrrol-3-yl]-6H-1,3,4-thiadiazin-2-yl]amine
TypeSmall organic molecule
Emp. Form.C18H19FN4S
Mol. Mass.342.434
SMILESCc1cc(c(C)n1-c1ccccc1F)C1=NN=C(NC2CC2)SC1