Reaction Details
TargetATP-dependent molecular chaperone HSP82
LigandBDBM68258
Substrate/Competitorn/a
Meas. Tech.FP Assay
IC50 2.1e+3±n/a nM
Citation Proisy, NSharp, SYBoxall, KConnelly, SRoe, SMProdromou, CSlawin, AMPearl, LHWorkman, PMoody, CJ Inhibition of Hsp90 with synthetic macrolactones: synthesis and structural and biological evaluation of ring and conformational analogs of radicicol. Chem Biol13:1203-15 (2006) 
 
ATP-dependent molecular chaperone HSP82
Name:ATP-dependent molecular chaperone HSP82
Type:Molecular Chaperone
Mol. Mass.:81369.08
Organism:Saccharomyces cerevisiae
Description:Histidine-tagged yeast HSP90 was transformed into E. coli and purified (>90%) by metal affinity, gel filtration, and ion-exchange chromatography.
Residue:709
BDBM68258
NameBDBM68258
Synonyms:Microlactone, 19
TypeSmall organic molecule
Emp. Form.C20H25ClO5
Mol. Mass.380.863
SMILESC[C@H](CC=C)OC(=O)c1c(O)cc(O)c(Cl)c1CC(=O)CCCCC=C