Reaction Details
TargetATP-dependent molecular chaperone HSP82
LigandBDBM68265
Substrate/Competitorn/a
Meas. Tech.FP Assay
IC50 1.1e+3±n/a nM
Citation Proisy, NSharp, SYBoxall, KConnelly, SRoe, SMProdromou, CSlawin, AMPearl, LHWorkman, PMoody, CJ Inhibition of Hsp90 with synthetic macrolactones: synthesis and structural and biological evaluation of ring and conformational analogs of radicicol. Chem Biol13:1203-15 (2006) 
 
ATP-dependent molecular chaperone HSP82
Name:ATP-dependent molecular chaperone HSP82
Type:Molecular Chaperone
Mol. Mass.:81369.08
Organism:Saccharomyces cerevisiae
Description:Histidine-tagged yeast HSP90 was transformed into E. coli and purified (>90%) by metal affinity, gel filtration, and ion-exchange chromatography.
Residue:709
BDBM68265
NameBDBM68265
Synonyms:Microlactone, 18
TypeSmall organic molecule
Emp. Form.C18H20Br2O5
Mol. Mass.476.156
SMILESOc1c(Br)c(O)c2c(CC(=O)CCCCCC=CCCOC2=O)c1Br