Reaction Details
TargetCytochrome P450 1B1
LigandBDBM68279
Substrate/Competitorn/a
Meas. Tech.EROD Assay
pH8±0
Temperature310.15±0 K
Ki 1.11e+3±n/a nM
Km270±0 nM
Citation Katsuyama, YFuna, NMiyahisa, IHorinouchi, S Synthesis of unnatural flavonoids and stilbenes by exploiting the plant biosynthetic pathway in Escherichia coli. Chem Biol14:613-21 (2007) 
 
Cytochrome P450 1B1
Name:Cytochrome P450 1B1
Type:PROTEIN
Mol. Mass.:60861.81
Organism:Homo sapiens (Human)
Description:ChEMBL_1474523
Residue:543
BDBM68279
NameBDBM68279
Synonyms:Stilbene, 15f
TypeSmall organic molecule
Emp. Form.C12H10O3
Mol. Mass.202.206
SMILESOc1cc(O)cc(\C=C\c2ccoc2)c1