Reaction Details
TargetCannabinoid receptor 2
LigandBDBM68294
Substrate/Competitorn/a
Meas. Tech.SAR analysis of antagonists of the Cannabinoid Receptor 2 using an Image-Based Assay - Set 2
IC50>32000±n/a nM
Citation PubChem, PC SAR analysis of antagonists of the Cannabinoid Receptor 2 using an Image-Based Assay - Set 2 PubChem Bioassay(2010)[AID]
 
Cannabinoid receptor 2
Name:Cannabinoid receptor 2
Type:G Protein-Coupled Receptor (GPCR)
Mol. Mass.:39690.94
Organism:Homo sapiens (Human)
Description:P34972
Residue:360
BDBM68294
NameBDBM68294
Synonyms:4-(2-ketopyrrolidino)-N-(3-morpholinosulfonylphenyl)benzamide N-(3-morpholin-4-ylsulfonylphenyl)-4-(2-oxidanylidenepyrrolidin-1-yl)benzamide N-[3-(4-morpholinylsulfonyl)phenyl]-4-(2-oxo-1-pyrrolidinyl)benzamide | cid_4292126
TypeSmall organic molecule
Emp. Form.C21H23N3O5S
Mol. Mass.429.489
SMILESO=C(Nc1cccc(c1)S(=O)(=O)N1CCOCC1)c1ccc(cc1)N1CCCC1=O