Reaction Details
TargetAlkanal monooxygenase alpha chain
LigandBDBM65977
Substrate/Competitorn/a
Meas. Tech.Absorbance Microorganism Dose Response to Identify Inhibitors of Vibrio harveyi
EC50>160000±n/a nM
Citation PubChem, PC Absorbance Microorganism Dose Response to Identify Inhibitors of Vibrio harveyi PubChem Bioassay(2010)[AID]
 
Alkanal monooxygenase alpha chain
Name:Alkanal monooxygenase alpha chain
Type:Enzyme Catalytic Domain
Mol. Mass.:40139.12
Organism:Vibrio harveyi
Description:gi_126509
Residue:355
BDBM65977
NameBDBM65977
Synonyms:1-ethenyl-5-(4-ethylphenyl)-2-pyrrolecarboxylic acid 5-(4-ethylphenyl)-1-vinyl-pyrrole-2-carboxylic acid SMR000274627 | cid_773801
TypeSmall organic molecule
Emp. Form.C15H15NO2
Mol. Mass.241.2851
SMILESCCc1ccc(cc1)-c1ccc(C(O)=O)n1C=C