Reaction Details
TargetAlkanal monooxygenase alpha chain
LigandBDBM65979
Substrate/Competitorn/a
Meas. Tech.Absorbance Microorganism Dose Response to Identify Inhibitors of Vibrio harveyi
EC50>160000±n/a nM
Citation PubChem, PC Absorbance Microorganism Dose Response to Identify Inhibitors of Vibrio harveyi PubChem Bioassay(2010)[AID]
 
Alkanal monooxygenase alpha chain
Name:Alkanal monooxygenase alpha chain
Type:Enzyme Catalytic Domain
Mol. Mass.:40139.12
Organism:Vibrio harveyi
Description:gi_126509
Residue:355
BDBM65979
NameBDBM65979
Synonyms:1-methyl-N-[4-(trifluoromethoxy)phenyl]-1H-imidazole-4-sulfonamide 1-methyl-N-[4-(trifluoromethoxy)phenyl]imidazole-4-sulfonamide MLS000673272 cid_2821584
TypeSmall organic molecule
Emp. Form.C11H10F3N3O3S
Mol. Mass.321.276
SMILESCn1cnc(c1)S(=O)(=O)Nc1ccc(OC(F)(F)F)cc1