Reaction Details
TargetS-ribosylhomocysteine lyase
LigandBDBM65981
Substrate/Competitorn/a
Meas. Tech.Luminescence Cell-Free Homogeneous Dose Response to Identify Inhibitors of Lux-S
EC50>350000±n/a nM
Citation PubChem, PC Luminescence Cell-Free Homogeneous Dose Response to Identify Inhibitors of Lux-S PubChem Bioassay(2010)[AID]
 
S-ribosylhomocysteine lyase
Name:S-ribosylhomocysteine lyase
Synonyms:LuxS
Type:Enzyme Catalytic Domain
Mol. Mass.:15564.06
Organism:Vibrio harveyi
Description:B0LUE4
Residue:140
BDBM65981
NameBDBM65981
TypeSmall organic molecule
Emp. Form.C16H18FNO4S2
Mol. Mass.371.447
SMILESCCCc1ccc(cc1)S(=O)(=O)N(C)S(=O)(=O)c1ccc(F)cc1