Reaction Details
TargetSerine/threonine-protein phosphatase
LigandBDBM44936
Substrate/Competitorn/a
Meas. Tech.Fluorescence Cell-Based Secondary Assay to Identify Inhibitors of Calcineurin
EC50 13510±n/a nM
Citation PubChem, PC Fluorescence Cell-Based Secondary Assay to Identify Inhibitors of Calcineurin PubChem Bioassay(2010)[AID]
 
Serine/threonine-protein phosphatase
Name:Serine/threonine-protein phosphatase
Type:Enzyme Catalytic Domain
Mol. Mass.:69558.03
Organism:Candida dubliniensis CD36
Description:gi_223640082
Residue:607
BDBM44936
NameBDBM44936
Synonyms:4-Chloro-benzoic acid N'-[2-(2,2,2-trifluoro-acetyl)-cyclopent-1-enyl]-hydrazide 4-chloro-N'-[2-(2,2,2-trifluoro-1-oxoethyl)-1-cyclopentenyl]benzohydrazide MLS000595382 cid_3147001
TypeSmall organic molecule
Emp. Form.C14H12ClF3N2O2
Mol. Mass.332.705
SMILESFC(F)(F)C(=O)C1=C(CCC1)NNC(=O)c1ccc(Cl)cc1