Reaction Details
TargetSerine/threonine-protein phosphatase
LigandBDBM68336
Substrate/Competitorn/a
Meas. Tech.Fluorescence Cell-Based Secondary Assay to Identify Inhibitors of Calcineurin
EC50>285000±n/a nM
Citation PubChem, PC Fluorescence Cell-Based Secondary Assay to Identify Inhibitors of Calcineurin PubChem Bioassay(2010)[AID]
 
Serine/threonine-protein phosphatase
Name:Serine/threonine-protein phosphatase
Type:Enzyme Catalytic Domain
Mol. Mass.:69558.03
Organism:Candida dubliniensis CD36
Description:gi_223640082
Residue:607
BDBM68336
NameBDBM68336
Synonyms:BRD-K57435385-001-01-8 N-[5-[(4-chlorophenyl)methylsulfanyl]-1,3,4-thiadiazol-2-yl]quinoline-2-carboxamide cid_2091582
TypeSmall organic molecule
Emp. Form.C19H13ClN4OS2
Mol. Mass.412.916
SMILESClc1ccc(CSc2nnc(NC(=O)c3ccc4ccccc4n3)s2)cc1