Reaction Details
TargetGlycogen synthase kinase-3 beta
LigandBDBM60444
Substrate/Competitorn/a
Meas. Tech.Luminescence Cell-Free Homogeneous Dose Retest to Identify Inhibitors of Glycogen Synthase Kinase-3 beta Activity
EC50>300000±n/a nM
Citation PubChem, PC Luminescence Cell-Free Homogeneous Dose Retest to Identify Inhibitors of Glycogen Synthase Kinase-3 beta Activity PubChem Bioassay(2010)[AID]
 
Glycogen synthase kinase-3 beta
Name:Glycogen synthase kinase-3 beta
Type:Enzyme
Mol. Mass.:46756.38
Organism:Homo sapiens (Human)
Description:P49841
Residue:420
BDBM60444
NameBDBM60444
Synonyms:3-(4-methylphenyl)-6-oxidanylidene-8-thiophen-2-yl-2,4,7,8-tetrahydropyrido[2,1-b][1,3,5]thiadiazine-9-carbonitrile 6-keto-3-(p-tolyl)-8-(2-thienyl)-2,4,7,8-tetrahydropyrido[2,1-b][1,3,5]thiadiazine-9-carbonitrile SMR000127753 | cid_3160859
TypeSmall organic molecule
Emp. Form.C19H17N3OS2
Mol. Mass.367.488
SMILESCc1ccc(cc1)N1CSC2=C(C#N)C(CC(=O)N2C1)c1cccs1