Reaction Details
TargetGlycogen synthase kinase-3 beta
LigandBDBM69473
Substrate/Competitorn/a
Meas. Tech.Luminescence Cell-Free Homogeneous Dose Retest to Identify Inhibitors of Glycogen Synthase Kinase-3 beta Activity
EC50>300000±n/a nM
Citation PubChem, PC Luminescence Cell-Free Homogeneous Dose Retest to Identify Inhibitors of Glycogen Synthase Kinase-3 beta Activity PubChem Bioassay(2010)[AID]
 
Glycogen synthase kinase-3 beta
Name:Glycogen synthase kinase-3 beta
Type:Enzyme
Mol. Mass.:46756.38
Organism:Homo sapiens (Human)
Description:P49841
Residue:420
BDBM69473
NameBDBM69473
Synonyms:1,3-dimethyl-8-propyl-7H-purine-2,6-dione 8-Propyltheophylline SMR000528150 | cid_76104
TypeSmall organic molecule
Emp. Form.C10H14N4O2
Mol. Mass.222.2438
SMILESCCCc1nc2n(C)c(=O)n(C)c(=O)c2[nH]1