Reaction Details
TargetHeat shock factor protein 1
LigandBDBM71661
Substrate/Competitorn/a
Meas. Tech.Luminescence Cell-Based Dose Retest to Identify Potentiators of Heat Shock Factor 1 (HSF1)
EC50>260000±n/a nM
Citation PubChem, PC Luminescence Cell-Based Dose Retest to Identify Potentiators of Heat Shock Factor 1 (HSF1) PubChem Bioassay(2010)[AID]
 
Heat shock factor protein 1
Name:Heat shock factor protein 1
Type:Enzyme Catalytic Domain
Mol. Mass.:57208.68
Organism:Mus musculus
Description:P38532
Residue:525
BDBM71661
NameBDBM71661
Synonyms:3-[2-(2-Methylcarbamoylmethyl-benzoimidazol-1-yl)-acetylamino]-benzoic acid ethyl ester 3-[[2-[2-[2-keto-2-(methylamino)ethyl]benzimidazol-1-yl]acetyl]amino]benzoic acid ethyl ester SMR000002627 ethyl 3-[2-[2-[2-(methylamino)-2-oxidanylidene-ethyl]benzimidazol-1-yl]ethanoylamino]benzoate | ethyl 3-[[2-[2-[2-(methylamino)-2-oxoethyl]benzimidazol-1-yl]acetyl]amino]benzoate
TypeSmall organic molecule
Emp. Form.C21H22N4O4
Mol. Mass.394.4238
SMILESCCOC(=O)c1cccc(NC(=O)Cn2c(CC(=O)NC)nc3ccccc23)c1