Reaction Details
TargetHeat shock factor protein 1
LigandBDBM71683
Substrate/Competitorn/a
Meas. Tech.Luminescence Cell-Based Dose Retest to Identify Potentiators of Heat Shock Factor 1 (HSF1)
EC50>260000±n/a nM
Citation PubChem, PC Luminescence Cell-Based Dose Retest to Identify Potentiators of Heat Shock Factor 1 (HSF1) PubChem Bioassay(2010)[AID]
 
Heat shock factor protein 1
Name:Heat shock factor protein 1
Type:Enzyme Catalytic Domain
Mol. Mass.:57208.68
Organism:Mus musculus
Description:P38532
Residue:525
BDBM71683
NameBDBM71683
Synonyms:1-(4-fluorophenyl)-3-(furan-2-yl)-3-(phenylsulfonyl)propan-1-one 3-(benzenesulfonyl)-1-(4-fluorophenyl)-3-(furan-2-yl)propan-1-one MLS000078095 cid_660889
TypeSmall organic molecule
Emp. Form.C19H15FO4S
Mol. Mass.358.383
SMILESFc1ccc(cc1)C(=O)CC(c1ccco1)S(=O)(=O)c1ccccc1