Reaction Details
TargetHeat shock factor protein 1
LigandBDBM47056
Substrate/Competitorn/a
Meas. Tech.Luminescence Cell-Based Dose Retest to Identify Potentiators of Heat Shock Factor 1 (HSF1)
EC50 57440±n/a nM
Citation PubChem, PC Luminescence Cell-Based Dose Retest to Identify Potentiators of Heat Shock Factor 1 (HSF1) PubChem Bioassay(2010)[AID]
 
Heat shock factor protein 1
Name:Heat shock factor protein 1
Type:Enzyme Catalytic Domain
Mol. Mass.:57208.68
Organism:Mus musculus
Description:P38532
Residue:525
BDBM47056
NameBDBM47056
Synonyms:1-(2-methylphenyl)-3-[(5-phenyl-1,3,4-oxadiazol-2-yl)sulfanyl]pyrrolidine-2,5-dione 1-(o-tolyl)-3-[(5-phenyl-1,3,4-oxadiazol-2-yl)thio]pyrrolidine-2,5-quinone SMR000037374 | cid_661736
TypeSmall organic molecule
Emp. Form.C19H15N3O3S
Mol. Mass.365.406
SMILESCc1ccccc1-n1c(O)cc(Sc2nnc(o2)-c2ccccc2)c1O