Reaction Details
TargetHeat shock factor protein 1
LigandBDBM36918
Substrate/Competitorn/a
Meas. Tech.Luminescence Cell-Based Dose Retest to Identify Potentiators of Heat Shock Factor 1 (HSF1)
EC50 98600±n/a nM
Citation PubChem, PC Luminescence Cell-Based Dose Retest to Identify Potentiators of Heat Shock Factor 1 (HSF1) PubChem Bioassay(2010)[AID]
 
Heat shock factor protein 1
Name:Heat shock factor protein 1
Type:Enzyme Catalytic Domain
Mol. Mass.:57208.68
Organism:Mus musculus
Description:P38532
Residue:525
BDBM36918
NameBDBM36918
Synonyms:MLS000040800 N-[(1S)-1-[5-[[2-(4-bromoanilino)-2-oxoethyl]thio]-1,3,4-oxadiazol-2-yl]-2-methylpropyl]carbamic acid tert-butyl ester cid_662310 tert-butyl N-[(1S)-1-[5-[2-[(4-bromophenyl)amino]-2-oxidanylidene-ethyl]sulfanyl-1,3,4-oxadiazol-2-yl]-2-methyl-propyl]carbamate
TypeSmall organic molecule
Emp. Form.C19H25BrN4O4S
Mol. Mass.485.395
SMILESCC(C)[C@H](NC(=O)OC(C)(C)C)c1nnc(SCC(=O)Nc2ccc(Br)cc2)o1