Reaction Details
TargetHeat shock factor protein 1
LigandBDBM71766
Substrate/Competitorn/a
Meas. Tech.Luminescence Cell-Based Dose Retest to Identify Potentiators of Heat Shock Factor 1 (HSF1)
EC50 63690±n/a nM
Citation PubChem, PC Luminescence Cell-Based Dose Retest to Identify Potentiators of Heat Shock Factor 1 (HSF1) PubChem Bioassay(2010)[AID]
 
Heat shock factor protein 1
Name:Heat shock factor protein 1
Type:Enzyme Catalytic Domain
Mol. Mass.:57208.68
Organism:Mus musculus
Description:P38532
Residue:525
BDBM71766
NameBDBM71766
Synonyms:4-(2-furanylmethylamino)-2-(2-methoxy-2-oxoethyl)-5-methyl-6-thieno[2,3-d]pyrimidinecarboxylic acid ethyl ester MLS000046886 cid_3239479 ethyl 4-(furan-2-ylmethylamino)-2-(2-methoxy-2-oxoethyl)-5-methylthieno[2,3-d]pyrimidine-6-carboxylate | ethyl 4-[(2-furylmethyl)amino]-2-(2-methoxy-2-oxoethyl)-5-methylthieno[2,3-d]pyrimidine-6-carboxylate
TypeSmall organic molecule
Emp. Form.C18H19N3O5S
Mol. Mass.389.426
SMILESCCOC(=O)c1sc2nc(CC(=O)OC)nc(NCc3ccco3)c2c1C