Reaction Details
TargetHeat shock factor protein 1
LigandBDBM38824
Substrate/Competitorn/a
Meas. Tech.Luminescence Cell-Based Dose Retest to Identify Potentiators of Heat Shock Factor 1 (HSF1)
EC50>260000±n/a nM
Citation PubChem, PC Luminescence Cell-Based Dose Retest to Identify Potentiators of Heat Shock Factor 1 (HSF1) PubChem Bioassay(2010)[AID]
 
Heat shock factor protein 1
Name:Heat shock factor protein 1
Type:Enzyme Catalytic Domain
Mol. Mass.:57208.68
Organism:Mus musculus
Description:P38532
Residue:525
BDBM38824
NameBDBM38824
Synonyms:1-(4-methoxybenzyl)-N-(3-morpholin-4-ylpropyl)-5-oxopyrrolidine-3-carboxamide 1-[(4-methoxyphenyl)methyl]-N-(3-morpholin-4-ylpropyl)-5-oxopyrrolidine-3-carboxamide 5-keto-N-(3-morpholinopropyl)-1-p-anisyl-pyrrolidine-3-carboxamide SMR000032465 | cid_3242857
TypeSmall organic molecule
Emp. Form.C20H29N3O4
Mol. Mass.375.462
SMILESCOc1ccc(CN2CC(CC2=O)C(=O)NCCCN2CCOCC2)cc1