Reaction Details
TargetHeat shock factor protein 1
LigandBDBM71792
Substrate/Competitorn/a
Meas. Tech.Luminescence Cell-Based Dose Retest to Identify Potentiators of Heat Shock Factor 1 (HSF1)
EC50>260000±n/a nM
Citation PubChem, PC Luminescence Cell-Based Dose Retest to Identify Potentiators of Heat Shock Factor 1 (HSF1) PubChem Bioassay(2010)[AID]
 
Heat shock factor protein 1
Name:Heat shock factor protein 1
Type:Enzyme Catalytic Domain
Mol. Mass.:57208.68
Organism:Mus musculus
Description:P38532
Residue:525
BDBM71792
NameBDBM71792
Synonyms:2-phenyl-5-(2-piperidin-1-ylethanoylamino)-1,2,3-triazole-4-carboxamide 2-phenyl-5-[(2-piperidinoacetyl)amino]triazole-4-carboxamide 5-[[1-oxo-2-(1-piperidinyl)ethyl]amino]-2-phenyl-4-triazolecarboxamide SMR000027688 | cid_715999
TypeSmall organic molecule
Emp. Form.C16H20N6O2
Mol. Mass.328.369
SMILESNC(=O)c1nn(nc1NC(=O)CN1CCCCC1)-c1ccccc1