Reaction Details
TargetHeat shock factor protein 1
LigandBDBM60057
Substrate/Competitorn/a
Meas. Tech.Luminescence Cell-Based Dose Retest to Identify Potentiators of Heat Shock Factor 1 (HSF1)
EC50>260000±n/a nM
Citation PubChem, PC Luminescence Cell-Based Dose Retest to Identify Potentiators of Heat Shock Factor 1 (HSF1) PubChem Bioassay(2010)[AID]
 
Heat shock factor protein 1
Name:Heat shock factor protein 1
Type:Enzyme Catalytic Domain
Mol. Mass.:57208.68
Organism:Mus musculus
Description:P38532
Residue:525
BDBM60057
NameBDBM60057
Synonyms:MLS000698754 N-(1,2-dihydroacenaphthylen-5-yl)-2-(6-hydroxy-4-oxo-1-phenylpyrimidin-2-yl)sulfanylacetamide N-(1,2-dihydroacenaphthylen-5-yl)-2-[(6-hydroxy-4-oxo-1-phenyl-2-pyrimidinyl)thio]acetamide SMR000226481 | cid_1208699
TypeSmall organic molecule
Emp. Form.C24H19N3O3S
Mol. Mass.429.491
SMILESOc1cc(=O)n(c(SCC(=O)Nc2ccc3CCc4cccc2c34)n1)-c1ccccc1