Reaction Details
TargetCytochrome b-245 heavy chain
LigandBDBM71623
Substrate/Competitorn/a
Meas. Tech.Late stage results from the probe development effort to identify inhibitors of (NADPH oxidase 1) NOX1: Family selectivity: Set 2
IC50>10000±n/a nM
Citation PubChem, PC Late stage results from the probe development effort to identify inhibitors of (NADPH oxidase 1) NOX1: Family selectivity: Set 2 PubChem Bioassay(2010)[AID]
 
Cytochrome b-245 heavy chain
Name:Cytochrome b-245 heavy chain
Type:Enzyme
Mol. Mass.:65355.82
Organism:Homo sapiens (Human)
Description:P04839
Residue:570
BDBM71623
NameBDBM71623
Synonyms:3,5-bis(chloranyl)-N-[(E)-[4-(dimethylamino)phenyl]methylideneamino]pyridin-4-amine 3,5-dichloro-N-[(E)-[4-(dimethylamino)phenyl]methylideneamino]pyridin-4-amine [4-[(E)-[(3,5-dichloro-4-pyridyl)hydrazono]methyl]phenyl]-dimethyl-amine | cid_9566216
TypeSmall organic molecule
Emp. Form.C14H14Cl2N4
Mol. Mass.309.194
SMILESCN(C)c1ccc(CN=Nc2c(Cl)cncc2Cl)cc1