Reaction Details
TargetCytochrome b-245 heavy chain
LigandBDBM65841
Substrate/Competitorn/a
Meas. Tech.Late stage results from the probe development effort to identify inhibitors of (NADPH oxidase 1) NOX1: Family selectivity: Set 2
IC50 9000±n/a nM
Citation PubChem, PC Late stage results from the probe development effort to identify inhibitors of (NADPH oxidase 1) NOX1: Family selectivity: Set 2 PubChem Bioassay(2010)[AID]
 
Cytochrome b-245 heavy chain
Name:Cytochrome b-245 heavy chain
Type:Enzyme
Mol. Mass.:65355.82
Organism:Homo sapiens (Human)
Description:P04839
Residue:570
BDBM65841
NameBDBM65841
Synonyms:2-(trifluoromethyl)-10H-phenothiazine cid_7082
TypeSmall organic molecule
Emp. Form.C13H8F3NS
Mol. Mass.267.27
SMILESFC(F)(F)c1ccc2Sc3ccccc3Nc2c1