Reaction Details
TargetCytochrome b-245 heavy chain
LigandBDBM67509
Substrate/Competitorn/a
Meas. Tech.Late stage results from the probe development effort to identify inhibitors of (NADPH oxidase 1) NOX1: Family selectivity: Set 2
IC50>50000±n/a nM
Citation PubChem, PC Late stage results from the probe development effort to identify inhibitors of (NADPH oxidase 1) NOX1: Family selectivity: Set 2 PubChem Bioassay(2010)[AID]
 
Cytochrome b-245 heavy chain
Name:Cytochrome b-245 heavy chain
Type:Enzyme
Mol. Mass.:65355.82
Organism:Homo sapiens (Human)
Description:P04839
Residue:570
BDBM67509
NameBDBM67509
Synonyms:2,6-dibromo-4-[[(3,5-dichloro-4-pyridinyl)hydrazo]methylidene]-1-cyclohexa-2,5-dienone 2,6-dibromo-4-[[N'-(3,5-dichloro-4-pyridyl)hydrazino]methylene]cyclohexa-2,5-dien-1-one SR-03000000731-1 | cid_5703786
TypeSmall organic molecule
Emp. Form.C12H7Br2Cl2N3O
Mol. Mass.439.917
SMILESOc1c(Br)cc(CN=Nc2c(Cl)cncc2Cl)cc1Br