Reaction Details
TargetG protein-activated inward rectifier potassium channel 1
LigandBDBM10759
Substrate/Competitorn/a
Meas. Tech.Measurement of GPCR-mediated thallium flux through GIRK channels: Dose-Response Testing
EC50 0.06142±n/a nM
Citation PubChem, PC Measurement of GPCR-mediated thallium flux through GIRK channels: Dose-Response Testing PubChem Bioassay(2010)[AID]
 
G protein-activated inward rectifier potassium channel 1
Name:G protein-activated inward rectifier potassium channel 1
Type:Enzyme Catalytic Domain
Mol. Mass.:56581.73
Organism:Rattus norvegicus
Description:gi_13928834
Residue:501
BDBM10759
NameBDBM10759
Synonyms:2-acetoxyethyl(trimethyl)ammonium;bromide CHEMBL667 [2-(acetyloxy)ethyl]trimethylazanium acetylcholine chloride | cid_6060
TypeSmall Organic Molecule
Emp. Form.C7H16NO2
Mol. Mass.146.2069
SMILESCC(=O)OCC[N+](C)(C)C