Reaction Details
TargetProtein LANA1
LigandBDBM39351
Substrate/Competitorn/a
Meas. Tech.Fluorescence Polarization Cell-Free Homogeneous Dose Retest to Confirm Inhibitors of the LANA Histone H2A/H2B Interaction
EC50>75000±n/a nM
Citation PubChem, PC Fluorescence Polarization Cell-Free Homogeneous Dose Retest to Confirm Inhibitors of the LANA Histone H2A/H2B Interaction PubChem Bioassay(2010)[AID]
 
Protein LANA1
Name:Protein LANA1
Type:Enzyme Catalytic Domain
Mol. Mass.:131093.36
Organism:Human herpesvirus 8
Description:Q9QR71
Residue:1129
BDBM39351
NameBDBM39351
Synonyms:CHLOROTHIAZIDE SMR000058429 cid_2720
TypeSmall organic molecule
Emp. Form.C7H6ClN3O4S2
Mol. Mass.295.723
SMILESNS(=O)(=O)c1cc2c(cc1Cl)N=CNS2(=O)=O