Reaction Details
TargetProtein LANA1
LigandBDBM42908
Substrate/Competitorn/a
Meas. Tech.Fluorescence Polarization Cell-Free Homogeneous Dose Retest to Confirm Inhibitors of the LANA Histone H2A/H2B Interaction
EC50 4895±n/a nM
Citation PubChem, PC Fluorescence Polarization Cell-Free Homogeneous Dose Retest to Confirm Inhibitors of the LANA Histone H2A/H2B Interaction PubChem Bioassay(2010)[AID]
 
Protein LANA1
Name:Protein LANA1
Type:Enzyme Catalytic Domain
Mol. Mass.:131093.36
Organism:Human herpesvirus 8
Description:Q9QR71
Residue:1129
BDBM42908
NameBDBM42908
Synonyms:6-(5-bromanylfuran-2-yl)-3-(4-chlorophenyl)-[1,2,4]triazolo[3,4-b][1,3,4]thiadiazole 6-(5-bromo-2-furyl)-3-(4-chlorophenyl)-[1,2,4]triazolo[3,4-b][1,3,4]thiadiazole MLS000041398 cid_665202
TypeSmall organic molecule
Emp. Form.C13H6BrClN4OS
Mol. Mass.381.635
SMILESClc1ccc(cc1)-c1nnc2sc(nn12)-c1ccc(Br)o1