Reaction Details
TargetProtein LANA1
LigandBDBM73280
Substrate/Competitorn/a
Meas. Tech.Fluorescence Polarization Cell-Free Homogeneous Dose Retest to Confirm Inhibitors of the LANA Histone H2A/H2B Interaction
EC50 5933±n/a nM
Citation PubChem, PC Fluorescence Polarization Cell-Free Homogeneous Dose Retest to Confirm Inhibitors of the LANA Histone H2A/H2B Interaction PubChem Bioassay(2010)[AID]
 
Protein LANA1
Name:Protein LANA1
Type:Enzyme Catalytic Domain
Mol. Mass.:131093.36
Organism:Human herpesvirus 8
Description:Q9QR71
Residue:1129
BDBM73280
NameBDBM73280
Synonyms:2-cyano-N-hexyl-2-(3-pyrrolidin-1-ylquinoxalin-2-yl)acetamide 2-cyano-N-hexyl-2-(3-pyrrolidinoquinoxalin-2-yl)acetamide MLS000048761 cid_2999890
TypeSmall organic molecule
Emp. Form.C21H27N5O
Mol. Mass.365.472
SMILESCCCCCCNC(=O)C(C#N)c1nc2ccccc2nc1N1CCCC1