Reaction Details
TargetProtein LANA1
LigandBDBM73314
Substrate/Competitorn/a
Meas. Tech.Fluorescence Polarization Cell-Free Homogeneous Dose Retest to Confirm Inhibitors of the LANA Histone H2A/H2B Interaction
EC50 96.7±n/a nM
Citation PubChem, PC Fluorescence Polarization Cell-Free Homogeneous Dose Retest to Confirm Inhibitors of the LANA Histone H2A/H2B Interaction PubChem Bioassay(2010)[AID]
 
Protein LANA1
Name:Protein LANA1
Type:Enzyme Catalytic Domain
Mol. Mass.:131093.36
Organism:Human herpesvirus 8
Description:Q9QR71
Residue:1129
BDBM73314
NameBDBM73314
Synonyms:3-(3-keto-1,4-benzoxazin-4-yl)-N-o-anisyl-propionamide N-(2-methoxybenzyl)-3-(3-oxo-2,3-dihydro-4H-1,4-benzoxazin-4-yl)propanamide N-[(2-methoxyphenyl)methyl]-3-(3-oxo-1,4-benzoxazin-4-yl)propanamide cid_3242687
TypeSmall organic molecule
Emp. Form.C19H20N2O4
Mol. Mass.340.3731
SMILESCOc1ccccc1CNC(=O)CCN1C(=O)COc2ccccc12