Reaction Details
TargetProtein LANA1
LigandBDBM41474
Substrate/Competitorn/a
Meas. Tech.Fluorescence Polarization Cell-Free Homogeneous Dose Retest to Confirm Inhibitors of the LANA Histone H2A/H2B Interaction
EC50 110.1±n/a nM
Citation PubChem, PC Fluorescence Polarization Cell-Free Homogeneous Dose Retest to Confirm Inhibitors of the LANA Histone H2A/H2B Interaction PubChem Bioassay(2010)[AID]
 
Protein LANA1
Name:Protein LANA1
Type:Enzyme Catalytic Domain
Mol. Mass.:131093.36
Organism:Human herpesvirus 8
Description:Q9QR71
Residue:1129
BDBM41474
NameBDBM41474
Synonyms:MLS000103371 cid_1789058
TypeSmall organic molecule
Emp. Form.C20H18N2O3
Mol. Mass.334.3685
SMILESCOCCCNc1c2-c3ccccc3C(=O)c3cccc([nH]c1=O)c23