Reaction Details
TargetProtein LANA1
LigandBDBM37250
Substrate/Competitorn/a
Meas. Tech.Fluorescence Polarization Cell-Free Homogeneous Dose Retest to Confirm Inhibitors of the LANA Histone H2A/H2B Interaction
EC50 5620±n/a nM
Citation PubChem, PC Fluorescence Polarization Cell-Free Homogeneous Dose Retest to Confirm Inhibitors of the LANA Histone H2A/H2B Interaction PubChem Bioassay(2010)[AID]
 
Protein LANA1
Name:Protein LANA1
Type:Enzyme Catalytic Domain
Mol. Mass.:131093.36
Organism:Human herpesvirus 8
Description:Q9QR71
Residue:1129
BDBM37250
NameBDBM37250
Synonyms:6-(1-azepanyl)-2-(3,5-dimethyl-1H-pyrazol-4-yl)benzo[de]isoquinoline-1,3-dione 6-(azepan-1-yl)-2-(3,5-dimethyl-1H-pyrazol-4-yl)benzo[de]isoquinoline-1,3-quinone SMR000106931 | cid_1347824
TypeSmall organic molecule
Emp. Form.C23H24N4O2
Mol. Mass.388.4623
SMILESCc1n[nH]c(C)c1N1C(=O)c2cccc3c(ccc(C1=O)c23)N1CCCCCC1