Reaction Details
TargetProtein LANA1
LigandBDBM50852
Substrate/Competitorn/a
Meas. Tech.Fluorescence Polarization Cell-Free Homogeneous Dose Retest to Confirm Inhibitors of the LANA Histone H2A/H2B Interaction
EC50 2602±n/a nM
Citation PubChem, PC Fluorescence Polarization Cell-Free Homogeneous Dose Retest to Confirm Inhibitors of the LANA Histone H2A/H2B Interaction PubChem Bioassay(2010)[AID]
 
Protein LANA1
Name:Protein LANA1
Type:Enzyme Catalytic Domain
Mol. Mass.:131093.36
Organism:Human herpesvirus 8
Description:Q9QR71
Residue:1129
BDBM50852
NameBDBM50852
Synonyms:(2-methoxy-1-naphthalenyl)-(1-methyl-2-imidazolyl)methanol (2-methoxynaphthalen-1-yl)-(1-methylimidazol-2-yl)methanol SMR000107155 | cid_2904872
TypeSmall organic molecule
Emp. Form.C16H16N2O2
Mol. Mass.268.3104
SMILESCOc1ccc2ccccc2c1C(O)c1nccn1C