Reaction Details
TargetProtein LANA1
LigandBDBM41817
Substrate/Competitorn/a
Meas. Tech.Fluorescence Polarization Cell-Free Homogeneous Dose Retest to Confirm Inhibitors of the LANA Histone H2A/H2B Interaction
EC50 324.8±n/a nM
Citation PubChem, PC Fluorescence Polarization Cell-Free Homogeneous Dose Retest to Confirm Inhibitors of the LANA Histone H2A/H2B Interaction PubChem Bioassay(2010)[AID]
 
Protein LANA1
Name:Protein LANA1
Type:Enzyme Catalytic Domain
Mol. Mass.:131093.36
Organism:Human herpesvirus 8
Description:Q9QR71
Residue:1129
BDBM41817
NameBDBM41817
Synonyms:9-benzo[c]quinolizin-11-iumol;iodide MLS000548877 benzo[c]quinolizin-11-ium-9-ol;iodide | cid_9549757
TypeSmall organic molecule
Emp. Form.C13H10NO
Mol. Mass.196.2241
SMILESOc1ccc2ccc3cccc[n+]3c2c1