Reaction Details
TargetProtein LANA1
LigandBDBM44475
Substrate/Competitorn/a
Meas. Tech.Fluorescence Polarization Cell-Free Homogeneous Dose Retest to Confirm Inhibitors of the LANA Histone H2A/H2B Interaction
EC50 4845±n/a nM
Citation PubChem, PC Fluorescence Polarization Cell-Free Homogeneous Dose Retest to Confirm Inhibitors of the LANA Histone H2A/H2B Interaction PubChem Bioassay(2010)[AID]
 
Protein LANA1
Name:Protein LANA1
Type:Enzyme Catalytic Domain
Mol. Mass.:131093.36
Organism:Human herpesvirus 8
Description:Q9QR71
Residue:1129
BDBM44475
NameBDBM44475
Synonyms:1-Pentyl-3-phenyl-1H-pyrazolo[3,4-b]quinoxaline 1-pentyl-3-phenyl-pyrazolo[4,3-b]quinoxaline MLS000557568 cid_2031089
TypeSmall organic molecule
Emp. Form.C20H20N4
Mol. Mass.316.3996
SMILESCCCCCn1nc(-c2ccccc2)c2nc3ccccc3nc12