Reaction Details
TargetProtein LANA1
LigandBDBM73438
Substrate/Competitorn/a
Meas. Tech.Fluorescence Polarization Cell-Free Homogeneous Dose Retest to Confirm Inhibitors of the LANA Histone H2A/H2B Interaction
EC50 6160±n/a nM
Citation PubChem, PC Fluorescence Polarization Cell-Free Homogeneous Dose Retest to Confirm Inhibitors of the LANA Histone H2A/H2B Interaction PubChem Bioassay(2010)[AID]
 
Protein LANA1
Name:Protein LANA1
Type:Enzyme Catalytic Domain
Mol. Mass.:131093.36
Organism:Human herpesvirus 8
Description:Q9QR71
Residue:1129
BDBM73438
NameBDBM73438
Synonyms:1-(1H-indol-3-yl)-2-thiomorpholin-4-yl-1-propanone 1-(1H-indol-3-yl)-2-thiomorpholin-4-ylpropan-1-one MLS000555946 cid_5149832
TypeSmall organic molecule
Emp. Form.C15H18N2OS
Mol. Mass.274.381
SMILESCC(N1CCSCC1)C(=O)c1c[nH]c2ccccc12