Reaction Details
TargetProtein LANA1
LigandBDBM73486
Substrate/Competitorn/a
Meas. Tech.Fluorescence Polarization Cell-Free Homogeneous Dose Retest to Confirm Inhibitors of the LANA Histone H2A/H2B Interaction
EC50 762.7±n/a nM
Citation PubChem, PC Fluorescence Polarization Cell-Free Homogeneous Dose Retest to Confirm Inhibitors of the LANA Histone H2A/H2B Interaction PubChem Bioassay(2010)[AID]
 
Protein LANA1
Name:Protein LANA1
Type:Enzyme Catalytic Domain
Mol. Mass.:131093.36
Organism:Human herpesvirus 8
Description:Q9QR71
Residue:1129
BDBM73486
NameBDBM73486
Synonyms:2-[4-Oxo-4-(4-phenyl-piperazin-1-yl)-butyl]-benzo[de]isoquinoline-1,3-dione 2-[4-oxidanylidene-4-(4-phenylpiperazin-1-yl)butyl]benzo[de]isoquinoline-1,3-dione 2-[4-oxo-4-(4-phenylpiperazin-1-yl)butyl]benzo[de]isoquinoline-1,3-dione SMR000177986 | cid_2892073
TypeSmall organic molecule
Emp. Form.C26H25N3O3
Mol. Mass.427.495
SMILESO=C(CCCN1C(=O)c2cccc3cccc(C1=O)c23)N1CCN(CC1)c1ccccc1