Reaction Details
TargetProtein LANA1
LigandBDBM51030
Substrate/Competitorn/a
Meas. Tech.Fluorescence Polarization Cell-Free Homogeneous Dose Retest to Confirm Inhibitors of the LANA Histone H2A/H2B Interaction
EC50 4202±n/a nM
Citation PubChem, PC Fluorescence Polarization Cell-Free Homogeneous Dose Retest to Confirm Inhibitors of the LANA Histone H2A/H2B Interaction PubChem Bioassay(2010)[AID]
 
Protein LANA1
Name:Protein LANA1
Type:Enzyme Catalytic Domain
Mol. Mass.:131093.36
Organism:Human herpesvirus 8
Description:Q9QR71
Residue:1129
BDBM51030
NameBDBM51030
Synonyms:8-amino-3-hexyl-1H-benzo[g]pteridine-2,4-dione 8-azanyl-3-hexyl-1H-benzo[g]pteridine-2,4-dione SMR000217535 | cid_5549699
TypeSmall organic molecule
Emp. Form.C16H19N5O2
Mol. Mass.313.3544
SMILESCCCCCCn1c(=O)[nH]c2nc3cc(N)ccc3nc2c1=O