Reaction Details
TargetProtein LANA1
LigandBDBM47591
Substrate/Competitorn/a
Meas. Tech.Fluorescence Polarization Cell-Free Homogeneous Dose Retest to Confirm Inhibitors of the LANA Histone H2A/H2B Interaction
EC50<60±n/a nM
Citation PubChem, PC Fluorescence Polarization Cell-Free Homogeneous Dose Retest to Confirm Inhibitors of the LANA Histone H2A/H2B Interaction PubChem Bioassay(2010)[AID]
 
Protein LANA1
Name:Protein LANA1
Type:Enzyme Catalytic Domain
Mol. Mass.:131093.36
Organism:Human herpesvirus 8
Description:Q9QR71
Residue:1129
BDBM47591
NameBDBM47591
Synonyms:(6'-acetyloxy-3-oxidanylidene-spiro[2-benzofuran-1,9'-xanthene]-3'-yl) ethanoate MLS000722997 acetic acid (6'-acetoxy-3-keto-spiro[phthalan-1,9'-xanthene]-3'-yl) ester cid_65047
TypeSmall organic molecule
Emp. Form.C24H16O7
Mol. Mass.416.3796
SMILESCC(=O)Oc1ccc2c(Oc3cc(OC(C)=O)ccc3C22OC(=O)c3ccccc23)c1